{"text_format":"1","workbook":"xlsx","n_sheets":4,"sheets":["Form SPA-1","2018 Eligible List","2024 Eligible List","Sheet1"],"not_rendered":{"charts":0,"images":0,"macros":0,"external_links":0,"defined_names":0,"comments":0,"pivot_tables":0},"unopened":[],"bounds":{"document_bytes":16777216,"sheet_cells":100000,"rows_first":2000,"rows_last":500,"rows_between":2000,"halvings":0,"cell_chars":16384,"cell_head_chars":4096},"cells_cut":0,"cells_raw":0,"read":"whole","date_system":"1900"}

{"sheet":"Form SPA-1","index":0,"n_rows":38,"n_cols":7,"rows_kept":38,"cut":false,"hidden":false,"merged":[[6,1,6,6],[10,4,11,4],[7,1,8,6],[10,2,11,2],[34,3,34,6],[10,1,11,1],[10,3,11,3],[10,5,11,5],[37,3,37,6],[38,1,38,2],[38,3,38,6],[35,3,36,6],[34,1,34,2],[37,1,37,2]]}
[null,null,null,null,null,null,"Form SPA-1"]
[null,"Contract Number",null,null,null,null,"Revised 10-23-2023"]
[null,"TIP Number"]
[null,"Standard Specifications Year"]
[null,"County and Route "]
[]
[null,{"$f":"CONCATENATE(C4,\" \",\"Bid Items Eligible for Steel Price Adjustment\")","v":" Bid Items Eligible for Steel Price Adjustment"}]
[null,"Instructions: This form shall be completed in accordance with the Special Provision.  If you choose to have Steel Price Adjustments applied to any of the items listed below, select the word “Yes” in the “Option” column corresponding to the item.  The form must be signed, dated, and submitted to the Contract Engineer within the timeframe required by the Special Provision."]
[]
[]
[null,"Contract Line Number","Item Number and Description","Item Number","Description ","Category","Option"]
[null,null,null,null,null,null,"(Yes or No)"]
[null,null,null,{"$f":"IF(C13=\"\",\"\",IF(C4=2018,VLOOKUP(C13,'2018 Eligible List'!A:G,2,FALSE),VLOOKUP(C13,'2024 Eligible List'!A:G,2,FALSE)))","v":""},{"$f":"IF(C13=\"\",\"\",IF(C4=2018,VLOOKUP(C13,'2018 Eligible List'!A:G,3,FALSE),VLOOKUP(C13,'2024 Eligible List'!A:G,3,FALSE)))","v":""},{"$f":"IF(C13=\"\",\"\",IF($C$4=2018,VLOOKUP(C13,'2018 Eligible List'!A:G,4,FALSE),VLOOKUP(C13,'2024 Eligible List'!A:G,4,FALSE)))","v":""}]
[null,null,null,{"$f":"IF(C14=\"\",\"\",IF(C5=2018,VLOOKUP(C14,'2018 Eligible List'!A:G,2,FALSE),VLOOKUP(C14,'2024 Eligible List'!A:G,2,FALSE)))","v":""},{"$f":"IF(C14=\"\",\"\",IF(C5=2018,VLOOKUP(C14,'2018 Eligible List'!A:G,3,FALSE),VLOOKUP(C14,'2024 Eligible List'!A:G,3,FALSE)))","v":""},{"$f":"IF(C14=\"\",\"\",IF($C$4=2018,VLOOKUP(C14,'2018 Eligible List'!A:G,4,FALSE),VLOOKUP(C14,'2024 Eligible List'!A:G,4,FALSE)))","v":""}]
[null,null,null,{"$f":"IF(C15=\"\",\"\",IF(C6=2018,VLOOKUP(C15,'2018 Eligible List'!A:G,2,FALSE),VLOOKUP(C15,'2024 Eligible List'!A:G,2,FALSE)))","v":""},{"$f":"IF(C15=\"\",\"\",IF(C6=2018,VLOOKUP(C15,'2018 Eligible List'!A:G,3,FALSE),VLOOKUP(C15,'2024 Eligible List'!A:G,3,FALSE)))","v":""},{"$f":"IF(C15=\"\",\"\",IF($C$4=2018,VLOOKUP(C15,'2018 Eligible List'!A:G,4,FALSE),VLOOKUP(C15,'2024 Eligible List'!A:G,4,FALSE)))","v":""}]
[null,null,null,{"$f":"IF(C16=\"\",\"\",IF(C7=2018,VLOOKUP(C16,'2018 Eligible List'!A:G,2,FALSE),VLOOKUP(C16,'2024 Eligible List'!A:G,2,FALSE)))","v":""},{"$f":"IF(C16=\"\",\"\",IF(C7=2018,VLOOKUP(C16,'2018 Eligible List'!A:G,3,FALSE),VLOOKUP(C16,'2024 Eligible List'!A:G,3,FALSE)))","v":""},{"$f":"IF(C16=\"\",\"\",IF($C$4=2018,VLOOKUP(C16,'2018 Eligible List'!A:G,4,FALSE),VLOOKUP(C16,'2024 Eligible List'!A:G,4,FALSE)))","v":""}]
[null,null,null,{"$f":"IF(C17=\"\",\"\",IF(C8=2018,VLOOKUP(C17,'2018 Eligible List'!A:G,2,FALSE),VLOOKUP(C17,'2024 Eligible List'!A:G,2,FALSE)))","v":""},{"$f":"IF(C17=\"\",\"\",IF(C8=2018,VLOOKUP(C17,'2018 Eligible List'!A:G,3,FALSE),VLOOKUP(C17,'2024 Eligible List'!A:G,3,FALSE)))","v":""},{"$f":"IF(C17=\"\",\"\",IF($C$4=2018,VLOOKUP(C17,'2018 Eligible List'!A:G,4,FALSE),VLOOKUP(C17,'2024 Eligible List'!A:G,4,FALSE)))","v":""}]
[null,null,null,{"$f":"IF(C18=\"\",\"\",IF(C9=2018,VLOOKUP(C18,'2018 Eligible List'!A:G,2,FALSE),VLOOKUP(C18,'2024 Eligible List'!A:G,2,FALSE)))","v":""},{"$f":"IF(C18=\"\",\"\",IF(C9=2018,VLOOKUP(C18,'2018 Eligible List'!A:G,3,FALSE),VLOOKUP(C18,'2024 Eligible List'!A:G,3,FALSE)))","v":""},{"$f":"IF(C18=\"\",\"\",IF($C$4=2018,VLOOKUP(C18,'2018 Eligible List'!A:G,4,FALSE),VLOOKUP(C18,'2024 Eligible List'!A:G,4,FALSE)))","v":""}]
[null,null,null,{"$f":"IF(C19=\"\",\"\",IF(C10=2018,VLOOKUP(C19,'2018 Eligible List'!A:G,2,FALSE),VLOOKUP(C19,'2024 Eligible List'!A:G,2,FALSE)))","v":""},{"$f":"IF(C19=\"\",\"\",IF(C10=2018,VLOOKUP(C19,'2018 Eligible List'!A:G,3,FALSE),VLOOKUP(C19,'2024 Eligible List'!A:G,3,FALSE)))","v":""},{"$f":"IF(C19=\"\",\"\",IF($C$4=2018,VLOOKUP(C19,'2018 Eligible List'!A:G,4,FALSE),VLOOKUP(C19,'2024 Eligible List'!A:G,4,FALSE)))","v":""}]
[null,null,null,{"$f":"IF(C20=\"\",\"\",IF(C11=2018,VLOOKUP(C20,'2018 Eligible List'!A:G,2,FALSE),VLOOKUP(C20,'2024 Eligible List'!A:G,2,FALSE)))","v":""},{"$f":"IF(C20=\"\",\"\",IF(C11=2018,VLOOKUP(C20,'2018 Eligible List'!A:G,3,FALSE),VLOOKUP(C20,'2024 Eligible List'!A:G,3,FALSE)))","v":""},{"$f":"IF(C20=\"\",\"\",IF($C$4=2018,VLOOKUP(C20,'2018 Eligible List'!A:G,4,FALSE),VLOOKUP(C20,'2024 Eligible List'!A:G,4,FALSE)))","v":""}]
[null,null,null,{"$f":"IF(C21=\"\",\"\",IF(C12=2018,VLOOKUP(C21,'2018 Eligible List'!A:G,2,FALSE),VLOOKUP(C21,'2024 Eligible List'!A:G,2,FALSE)))","v":""},{"$f":"IF(C21=\"\",\"\",IF(C12=2018,VLOOKUP(C21,'2018 Eligible List'!A:G,3,FALSE),VLOOKUP(C21,'2024 Eligible List'!A:G,3,FALSE)))","v":""},{"$f":"IF(C21=\"\",\"\",IF($C$4=2018,VLOOKUP(C21,'2018 Eligible List'!A:G,4,FALSE),VLOOKUP(C21,'2024 Eligible List'!A:G,4,FALSE)))","v":""}]
[null,null,null,{"$f":"IF(C22=\"\",\"\",IF(C13=2018,VLOOKUP(C22,'2018 Eligible List'!A:G,2,FALSE),VLOOKUP(C22,'2024 Eligible List'!A:G,2,FALSE)))","v":""},{"$f":"IF(C22=\"\",\"\",IF(C13=2018,VLOOKUP(C22,'2018 Eligible List'!A:G,3,FALSE),VLOOKUP(C22,'2024 Eligible List'!A:G,3,FALSE)))","v":""},{"$f":"IF(C22=\"\",\"\",IF($C$4=2018,VLOOKUP(C22,'2018 Eligible List'!A:G,4,FALSE),VLOOKUP(C22,'2024 Eligible List'!A:G,4,FALSE)))","v":""}]
[null,null,null,{"$f":"IF(C23=\"\",\"\",IF(C14=2018,VLOOKUP(C23,'2018 Eligible List'!A:G,2,FALSE),VLOOKUP(C23,'2024 Eligible List'!A:G,2,FALSE)))","v":""},{"$f":"IF(C23=\"\",\"\",IF(C14=2018,VLOOKUP(C23,'2018 Eligible List'!A:G,3,FALSE),VLOOKUP(C23,'2024 Eligible List'!A:G,3,FALSE)))","v":""},{"$f":"IF(C23=\"\",\"\",IF($C$4=2018,VLOOKUP(C23,'2018 Eligible List'!A:G,4,FALSE),VLOOKUP(C23,'2024 Eligible List'!A:G,4,FALSE)))","v":""}]
[null,null,null,{"$f":"IF(C24=\"\",\"\",IF(C15=2018,VLOOKUP(C24,'2018 Eligible List'!A:G,2,FALSE),VLOOKUP(C24,'2024 Eligible List'!A:G,2,FALSE)))","v":""},{"$f":"IF(C24=\"\",\"\",IF(C15=2018,VLOOKUP(C24,'2018 Eligible List'!A:G,3,FALSE),VLOOKUP(C24,'2024 Eligible List'!A:G,3,FALSE)))","v":""},{"$f":"IF(C24=\"\",\"\",IF($C$4=2018,VLOOKUP(C24,'2018 Eligible List'!A:G,4,FALSE),VLOOKUP(C24,'2024 Eligible List'!A:G,4,FALSE)))","v":""}]
[null,null,null,{"$f":"IF(C25=\"\",\"\",IF(C16=2018,VLOOKUP(C25,'2018 Eligible List'!A:G,2,FALSE),VLOOKUP(C25,'2024 Eligible List'!A:G,2,FALSE)))","v":""},{"$f":"IF(C25=\"\",\"\",IF(C16=2018,VLOOKUP(C25,'2018 Eligible List'!A:G,3,FALSE),VLOOKUP(C25,'2024 Eligible List'!A:G,3,FALSE)))","v":""},{"$f":"IF(C25=\"\",\"\",IF($C$4=2018,VLOOKUP(C25,'2018 Eligible List'!A:G,4,FALSE),VLOOKUP(C25,'2024 Eligible List'!A:G,4,FALSE)))","v":""}]
[null,null,null,{"$f":"IF(C26=\"\",\"\",IF(C17=2018,VLOOKUP(C26,'2018 Eligible List'!A:G,2,FALSE),VLOOKUP(C26,'2024 Eligible List'!A:G,2,FALSE)))","v":""},{"$f":"IF(C26=\"\",\"\",IF(C17=2018,VLOOKUP(C26,'2018 Eligible List'!A:G,3,FALSE),VLOOKUP(C26,'2024 Eligible List'!A:G,3,FALSE)))","v":""},{"$f":"IF(C26=\"\",\"\",IF($C$4=2018,VLOOKUP(C26,'2018 Eligible List'!A:G,4,FALSE),VLOOKUP(C26,'2024 Eligible List'!A:G,4,FALSE)))","v":""}]
[null,null,null,{"$f":"IF(C27=\"\",\"\",IF(C18=2018,VLOOKUP(C27,'2018 Eligible List'!A:G,2,FALSE),VLOOKUP(C27,'2024 Eligible List'!A:G,2,FALSE)))","v":""},{"$f":"IF(C27=\"\",\"\",IF(C18=2018,VLOOKUP(C27,'2018 Eligible List'!A:G,3,FALSE),VLOOKUP(C27,'2024 Eligible List'!A:G,3,FALSE)))","v":""},{"$f":"IF(C27=\"\",\"\",IF($C$4=2018,VLOOKUP(C27,'2018 Eligible List'!A:G,4,FALSE),VLOOKUP(C27,'2024 Eligible List'!A:G,4,FALSE)))","v":""}]
[null,null,null,{"$f":"IF(C28=\"\",\"\",IF(C19=2018,VLOOKUP(C28,'2018 Eligible List'!A:G,2,FALSE),VLOOKUP(C28,'2024 Eligible List'!A:G,2,FALSE)))","v":""},{"$f":"IF(C28=\"\",\"\",IF(C19=2018,VLOOKUP(C28,'2018 Eligible List'!A:G,3,FALSE),VLOOKUP(C28,'2024 Eligible List'!A:G,3,FALSE)))","v":""},{"$f":"IF(C28=\"\",\"\",IF($C$4=2018,VLOOKUP(C28,'2018 Eligible List'!A:G,4,FALSE),VLOOKUP(C28,'2024 Eligible List'!A:G,4,FALSE)))","v":""}]
[null,null,null,{"$f":"IF(C29=\"\",\"\",IF(C20=2018,VLOOKUP(C29,'2018 Eligible List'!A:G,2,FALSE),VLOOKUP(C29,'2024 Eligible List'!A:G,2,FALSE)))","v":""},{"$f":"IF(C29=\"\",\"\",IF(C20=2018,VLOOKUP(C29,'2018 Eligible List'!A:G,3,FALSE),VLOOKUP(C29,'2024 Eligible List'!A:G,3,FALSE)))","v":""},{"$f":"IF(C29=\"\",\"\",IF($C$4=2018,VLOOKUP(C29,'2018 Eligible List'!A:G,4,FALSE),VLOOKUP(C29,'2024 Eligible List'!A:G,4,FALSE)))","v":""}]
[null,null,null,{"$f":"IF(C30=\"\",\"\",IF(C21=2018,VLOOKUP(C30,'2018 Eligible List'!A:G,2,FALSE),VLOOKUP(C30,'2024 Eligible List'!A:G,2,FALSE)))","v":""},{"$f":"IF(C30=\"\",\"\",IF(C21=2018,VLOOKUP(C30,'2018 Eligible List'!A:G,3,FALSE),VLOOKUP(C30,'2024 Eligible List'!A:G,3,FALSE)))","v":""},{"$f":"IF(C30=\"\",\"\",IF($C$4=2018,VLOOKUP(C30,'2018 Eligible List'!A:G,4,FALSE),VLOOKUP(C30,'2024 Eligible List'!A:G,4,FALSE)))","v":""}]
[null,null,null,{"$f":"IF(C31=\"\",\"\",IF(C22=2018,VLOOKUP(C31,'2018 Eligible List'!A:G,2,FALSE),VLOOKUP(C31,'2024 Eligible List'!A:G,2,FALSE)))","v":""},{"$f":"IF(C31=\"\",\"\",IF(C22=2018,VLOOKUP(C31,'2018 Eligible List'!A:G,3,FALSE),VLOOKUP(C31,'2024 Eligible List'!A:G,3,FALSE)))","v":""},{"$f":"IF(C31=\"\",\"\",IF($C$4=2018,VLOOKUP(C31,'2018 Eligible List'!A:G,4,FALSE),VLOOKUP(C31,'2024 Eligible List'!A:G,4,FALSE)))","v":""}]
[null,null,null,{"$f":"IF(C32=\"\",\"\",IF(C23=2018,VLOOKUP(C32,'2018 Eligible List'!A:G,2,FALSE),VLOOKUP(C32,'2024 Eligible List'!A:G,2,FALSE)))","v":""},{"$f":"IF(C32=\"\",\"\",IF(C23=2018,VLOOKUP(C32,'2018 Eligible List'!A:G,3,FALSE),VLOOKUP(C32,'2024 Eligible List'!A:G,3,FALSE)))","v":""},{"$f":"IF(C32=\"\",\"\",IF($C$4=2018,VLOOKUP(C32,'2018 Eligible List'!A:G,4,FALSE),VLOOKUP(C32,'2024 Eligible List'!A:G,4,FALSE)))","v":""}]
[null,null,null,{"$f":"IF(C33=\"\",\"\",IF(C24=2018,VLOOKUP(C33,'2018 Eligible List'!A:G,2,FALSE),VLOOKUP(C33,'2024 Eligible List'!A:G,2,FALSE)))","v":""},{"$f":"IF(C33=\"\",\"\",IF(C24=2018,VLOOKUP(C33,'2018 Eligible List'!A:G,3,FALSE),VLOOKUP(C33,'2024 Eligible List'!A:G,3,FALSE)))","v":""},{"$f":"IF(C33=\"\",\"\",IF($C$4=2018,VLOOKUP(C33,'2018 Eligible List'!A:G,4,FALSE),VLOOKUP(C33,'2024 Eligible List'!A:G,4,FALSE)))","v":""}]
[null,null,null,{"$f":"IF(C34=\"\",\"\",IF(C25=2018,VLOOKUP(C34,'2018 Eligible List'!A:G,2,FALSE),VLOOKUP(C34,'2024 Eligible List'!A:G,2,FALSE)))","v":""},{"$f":"IF(C34=\"\",\"\",IF(C25=2018,VLOOKUP(C34,'2018 Eligible List'!A:G,3,FALSE),VLOOKUP(C34,'2024 Eligible List'!A:G,3,FALSE)))","v":""},{"$f":"IF(C34=\"\",\"\",IF($C$4=2018,VLOOKUP(C34,'2018 Eligible List'!A:G,4,FALSE),VLOOKUP(C34,'2024 Eligible List'!A:G,4,FALSE)))","v":""}]
[null,"Signature  (Print and Sign Your Name)",null,"Firm or Corporation"]
[null,"PRINT NAME"]
[null,"SIGN NAME"]
[null,"Date:",null,"Vendor Number"]

{"sheet":"2018 Eligible List","index":1,"n_rows":140,"n_cols":7,"rows_kept":140,"cut":false,"hidden":false,"merged":[]}
["Item Number and Long Description","Item Number","Long Description","Category","Unit of Measure","Section Number","Category Description"]
[{"$f":"CONCATENATE(B2,\" - \",C2)","v":"1735000000-E - REPAIR OF JOINTED CONCRETE    PAVEMENT SLABS,"},"1735000000-E","REPAIR OF JOINTED CONCRETE    PAVEMENT SLABS,",1,"Square Yards",723,"Paving"]
[{"$f":"CONCATENATE(B3,\" - \",C3)","v":"1847000000-E - ***** PORT CEM CONC PAVEMENT,THROUGH LANES (WITH DOWELS),\""},"1847000000-E","***** PORT CEM CONC PAVEMENT,THROUGH LANES (WITH DOWELS),\"",1,"Square Yards",710,"Paving"]
["1858000000-E - ***** PORT CEM CONC PAVEMENT,RAMPS (WITH DOWELS),\"","1858000000-E","***** PORT CEM CONC PAVEMENT,RAMPS (WITH DOWELS),\"",1,"Square Yards",710,"Paving"]
["2703000000-E - CONCRETE BARRIER, TYPE *******,","2703000000-E","CONCRETE BARRIER, TYPE *******,",1,"Linear Feet",854,"Paving"]
["2710000000-N - CONCRETE BARRIER TRANSITION   SECTION,","2710000000-N","CONCRETE BARRIER TRANSITION   SECTION,",1,"Each",854,"Paving"]
["2717000000-E - VARIABLE HEIGHT CONCRETE BAR- RIER, TYPE ************,","2717000000-E","VARIABLE HEIGHT CONCRETE BAR- RIER, TYPE ************,",1,"Linear Feet",854,"Paving"]
["3000000000-N - IMPACT ATTENUATOR UNIT, TYPE  350,","3000000000-N","IMPACT ATTENUATOR UNIT, TYPE  350,",4,"Each",9000,"Guardrail (GR)"]
["3001000000-N - IMPACT ATTENUATOR UNITS, TYPE  TL-3,","3001000000-N","IMPACT ATTENUATOR UNITS, TYPE  TL-3,",4,"Each",9000,"Guardrail (GR)"]
["3001500000-N - IMPACT ATTENUATOR UNITS, TYPE  TL-2,","3001500000-N","IMPACT ATTENUATOR UNITS, TYPE  TL-2,",4,"Each",9000,"Guardrail (GR)"]
["3030000000-E - STEEL BEAM GUARDRAIL,","3030000000-E","STEEL BEAM GUARDRAIL,",4,"Linear Feet",862,"Guardrail (GR)"]
["3045000000-E - STEEL BEAM GUARDRAIL, SHOP    CURVED,","3045000000-E","STEEL BEAM GUARDRAIL, SHOP    CURVED,",4,"Linear Feet",862,"Guardrail (GR)"]
["3060000000-E - STEEL BEAM GUARDRAIL, DOUBLE  FACED,","3060000000-E","STEEL BEAM GUARDRAIL, DOUBLE  FACED,",4,"Linear Feet",862,"Guardrail (GR)"]
["3075000000-E - TRIPLE CORRUGATED STEEL BM    GUARDRAIL,","3075000000-E","TRIPLE CORRUGATED STEEL BM    GUARDRAIL,",4,"Linear Feet",862,"Guardrail (GR)"]
["3090000000-N - TRIPLE CORRUGATED STEEL BEAMGUARDRAIL TERMINAL SECTIONS,","3090000000-N","TRIPLE CORRUGATED STEEL BEAMGUARDRAIL TERMINAL SECTIONS,",4,"Each",862,"Guardrail (GR)"]
["3105000000-N - STEEL BEAM GUARDRAIL TERMINAL SECTIONS,","3105000000-N","STEEL BEAM GUARDRAIL TERMINAL SECTIONS,",4,"Each",862,"Guardrail (GR)"]
["3120000000-E - 20 TUBULAR TRIPLE CORRUGATEDSTEEL BEAM GUARDRAIL,\"","3120000000-E","20 TUBULAR TRIPLE CORRUGATEDSTEEL BEAM GUARDRAIL,\"",4,"Linear Feet",862,"Guardrail (GR)"]
["3135000000-N - W-TR STEEL BEAM GUARDRAILTRANSITION SECTIONS,","3135000000-N","W-TR STEEL BEAM GUARDRAILTRANSITION SECTIONS,",4,"Each",862,"Guardrail (GR)"]
["3140000000-E - 25' CLEAR SPAN GUARDRAIL SEC- TIONS,","3140000000-E","25' CLEAR SPAN GUARDRAIL SEC- TIONS,",4,"Each",862,"Guardrail (GR)"]
["3145000000-E - EXTRA LENGTH GUARDRAIL POST   (**' STEEL),","3145000000-E","EXTRA LENGTH GUARDRAIL POST   (**' STEEL),",4,"Each",862,"Guardrail (GR)"]
["3150000000-N - ADDITIONAL GUARDRAIL POSTS,","3150000000-N","ADDITIONAL GUARDRAIL POSTS,",4,"Each",862,"Guardrail (GR)"]
["3165500000-N - GUARDRAIL END UNITS, TYPE     ************,","3165500000-N","GUARDRAIL END UNITS, TYPE     ************,",4,"Each",862,"Guardrail (GR)"]
["3195000000-N - GUARDRAIL END UNITS, TYPE     AT-1,","3195000000-N","GUARDRAIL END UNITS, TYPE     AT-1,",4,"Each",863,"Guardrail (GR)"]
["3210000000-N - GUARDRAIL END UNITS, TYPE     CAT-1,","3210000000-N","GUARDRAIL END UNITS, TYPE     CAT-1,",4,"Each",862,"Guardrail (GR)"]
["3215000000-N - GUARDRAIL ANCHOR UNITS, TYPE  III,","3215000000-N","GUARDRAIL ANCHOR UNITS, TYPE  III,",4,"Each",9000,"Guardrail (GR)"]
["3287000000-N - GUARDRAIL END UNITS, TYPE TL-3,","3287000000-N","GUARDRAIL END UNITS, TYPE TL-3,",4,"Each",9000,"Guardrail (GR)"]
["3288000000-N - GUARDRAIL END UNITS, TYPE TL-2,","3288000000-N","GUARDRAIL END UNITS, TYPE TL-2,",4,"Each",9000,"Guardrail (GR)"]
["3289000000-N - GUARDRAIL END UNITS, TYPE     MEDIAN TL-3,","3289000000-N","GUARDRAIL END UNITS, TYPE     MEDIAN TL-3,",4,"Each",9000,"Guardrail (GR)"]
["3317000000-N - GUARDRAIL ANCHOR UNITS, TYPE  B-77,","3317000000-N","GUARDRAIL ANCHOR UNITS, TYPE  B-77,",4,"Each",9000,"Guardrail (GR)"]
["3319000000-N - GUARDRAIL ANCHOR UNITS, TYPE  B-83,","3319000000-N","GUARDRAIL ANCHOR UNITS, TYPE  B-83,",4,"Each",9000,"Guardrail (GR)"]
["3389200000-E - CABLE GUIDERAIL,","3389200000-E","CABLE GUIDERAIL,",4,"Linear Feet",865,"Guardrail (GR)"]
["3389400000-E - DOUBLE FACED CABLE GUIDERAIL,","3389400000-E","DOUBLE FACED CABLE GUIDERAIL,",4,"Linear Feet",865,"Guardrail (GR)"]
["3389500000-N - ADDITIONAL GUIDERAIL POSTS,","3389500000-N","ADDITIONAL GUIDERAIL POSTS,",4,"Each",865,"Guardrail (GR)"]
["3500000000-E - WOVEN WIRE FENCE, ** FABRIC,\"","3500000000-E","WOVEN WIRE FENCE, ** FABRIC,\"",5,"Linear Feet",866,"Fence(F)"]
["3503000000-E - WOVEN WIRE FENCE, 47 FABRIC,\"","3503000000-E","WOVEN WIRE FENCE, 47 FABRIC,\"",5,"Linear Feet",866,"Fence(F)"]
["3518000000-E - CHAIN LINK FENCE, ** FABRIC  WITH REDWOOD PICKETS,\"","3518000000-E","CHAIN LINK FENCE, ** FABRIC  WITH REDWOOD PICKETS,\"",5,"Linear Feet",9000,"Fence(F)"]
["3521000000-E - VINYL COATED CHAIN LINK FENCE,** FABRIC WITH REDWOOD PIC-KETS,\"","3521000000-E","VINYL COATED CHAIN LINK FENCE,** FABRIC WITH REDWOOD PIC-KETS,\"",5,"Linear Feet",9000,"Fence(F)"]
["3524000000-E - VINYL COATED CHAIN LINK FENCE,** FABRIC,\"","3524000000-E","VINYL COATED CHAIN LINK FENCE,** FABRIC,\"",5,"Linear Feet",9000,"Fence(F)"]
["3527000000-E - CHAIN LINK FENCE, ** FABRIC, GUARDRAIL MOUNTED,\"","3527000000-E","CHAIN LINK FENCE, ** FABRIC, GUARDRAIL MOUNTED,\"",5,"Linear Feet",9000,"Fence(F)"]
["3530000000-E - CHAIN LINK FENCE, ** FABRIC  WITH 1\" MESH,\"","3530000000-E","CHAIN LINK FENCE, ** FABRIC  WITH 1\" MESH,\"",5,"Linear Feet",9000,"Fence(F)"]
{"$rows_left_out":101}
{"sheet":"2024 Eligible List","index":2,"n_rows":215,"n_cols":7,"rows_kept":215,"cut":false,"hidden":false,"merged":[]}
["Item Number and Long Description","Item Number","Long Description","Category","Unit of Measure","Section Number","Category Description"]
[{"$f":"CONCATENATE(B2,\" - \",C2)","v":"1735000000-E - REPAIR OF JOINTED CONCRETE PAVEMENT SLABS"},"1735000000-E","REPAIR OF JOINTED CONCRETE PAVEMENT SLABS",1,"Square Yards",723,"Paving"]
[{"$f":"CONCATENATE(B3,\" - \",C3)","v":"1847000000-E - *****\" PORT CEM CONC PAVEMENT, THROUGH LANES (WITH DOWELS)"},"1847000000-E","*****\" PORT CEM CONC PAVEMENT, THROUGH LANES (WITH DOWELS)",1,"Square Yards",710,"Paving"]
[{"$f":"CONCATENATE(B4,\" - \",C4)","v":"1858000000-E - *****\" PORT CEM CONC PAVEMENT, RAMPS (WITH DOWELS)"},"1858000000-E","*****\" PORT CEM CONC PAVEMENT, RAMPS (WITH DOWELS)",1,"Square Yards",710,"Paving"]
["2703000000-E - CONCRETE BARRIER, TYPE *******","2703000000-E","CONCRETE BARRIER, TYPE *******",1,"Linear Feet",854,"Paving"]
["2710000000-N - CONCRETE BARRIER TRANSITION SECTION","2710000000-N","CONCRETE BARRIER TRANSITION SECTION",1,"Each",854,"Paving"]
["2717000000-E - VARIABLE HEIGHT CONCRETE BARRIER,\nTYPE ************","2717000000-E","VARIABLE HEIGHT CONCRETE BARRIER,\nTYPE ************",1,"Linear Feet",854,"Paving"]
["3000000000-N - IMPACT ATTENUATOR UNIT, TYPE 350","3000000000-N","IMPACT ATTENUATOR UNIT, TYPE 350",4,"Each",9000,"Guardrail (GR)"]
["3001000000-N - IMPACT ATTENUATOR UNITS, TYPE TL-3","3001000000-N","IMPACT ATTENUATOR UNITS, TYPE TL-3",4,"Each",9000,"Guardrail (GR)"]
["3001500000-N - IMPACT ATTENUATOR UNITS, TYPE TL-2","3001500000-N","IMPACT ATTENUATOR UNITS, TYPE TL-2",4,"Each",9000,"Guardrail (GR)"]
["3030000000-E - STEEL BEAM GUARDRAIL","3030000000-E","STEEL BEAM GUARDRAIL",4,"Linear Feet",862,"Guardrail (GR)"]
["3045000000-E - STEEL BEAM GUARDRAIL, SHOP CURVED","3045000000-E","STEEL BEAM GUARDRAIL, SHOP CURVED",4,"Linear Feet",862,"Guardrail (GR)"]
["3060000000-E - STEEL BEAM GUARDRAIL, DOUBLE FACED","3060000000-E","STEEL BEAM GUARDRAIL, DOUBLE FACED",4,"Linear Feet",862,"Guardrail (GR)"]
["3075000000-E - TRIPLE CORRUGATED STEEL BEAM GUARDRAIL","3075000000-E","TRIPLE CORRUGATED STEEL BEAM GUARDRAIL",4,"Linear Feet",862,"Guardrail (GR)"]
["3090000000-N - TRIPLE CORRUGATED STEEL BEAM GUARDRAIL TERMINAL SECTIONS","3090000000-N","TRIPLE CORRUGATED STEEL BEAM GUARDRAIL TERMINAL SECTIONS",4,"Each",862,"Guardrail (GR)"]
["3105000000-N - STEEL BEAM GUARDRAIL TERMINAL SECTIONS","3105000000-N","STEEL BEAM GUARDRAIL TERMINAL SECTIONS",4,"Each",862,"Guardrail (GR)"]
["3120000000-E - 20\" TUBULAR TRIPLE CORRUGATED STEEL BEAM GUARDRAIL","3120000000-E","20\" TUBULAR TRIPLE CORRUGATED STEEL BEAM GUARDRAIL",4,"Linear Feet",862,"Guardrail (GR)"]
["3135000000-N - W-TR STEEL BEAM GUARDRAIL TRANSITION SECTIONS","3135000000-N","W-TR STEEL BEAM GUARDRAIL TRANSITION SECTIONS",4,"Each",862,"Guardrail (GR)"]
["3140000000-E - 25' CLEAR SPAN GUARDRAIL SECTIONS","3140000000-E","25' CLEAR SPAN GUARDRAIL SECTIONS",4,"Each",862,"Guardrail (GR)"]
["3145000000-E - EXTRA LENGTH GUARDRAIL POST (**' STEEL)","3145000000-E","EXTRA LENGTH GUARDRAIL POST (**' STEEL)",4,"Each",862,"Guardrail (GR)"]
["3150000000-N - ADDITIONAL GUARDRAIL POSTS","3150000000-N","ADDITIONAL GUARDRAIL POSTS",4,"Each",862,"Guardrail (GR)"]
["3165500000-N - GUARDRAIL END UNITS, TYPE ************","3165500000-N","GUARDRAIL END UNITS, TYPE ************",4,"Each",862,"Guardrail (GR)"]
["3195000000-N - GUARDRAIL END UNITS, TYPE AT-1","3195000000-N","GUARDRAIL END UNITS, TYPE AT-1",4,"Each",862,"Guardrail (GR)"]
["3210000000-N - GUARDRAIL END UNITS, TYPE CAT-1","3210000000-N","GUARDRAIL END UNITS, TYPE CAT-1",4,"Each",862,"Guardrail (GR)"]
["3215000000-N - GUARDRAIL ANCHOR UNITS, TYPE III","3215000000-N","GUARDRAIL ANCHOR UNITS, TYPE III",4,"Each",862,"Guardrail (GR)"]
["3287000000-N - GUARDRAIL END UNITS, TYPE TL-3","3287000000-N","GUARDRAIL END UNITS, TYPE TL-3",4,"Each",862,"Guardrail (GR)"]
["3288000000-N - GUARDRAIL END UNITS, TYPE TL-2","3288000000-N","GUARDRAIL END UNITS, TYPE TL-2",4,"Each",862,"Guardrail (GR)"]
["3289000000-N - GUARDRAIL END UNITS, TYPE MEDIAN TL-3","3289000000-N","GUARDRAIL END UNITS, TYPE MEDIAN TL-3",4,"Each",862,"Guardrail (GR)"]
["3317000000-N - GUARDRAIL ANCHOR UNITS, TYPE B-77","3317000000-N","GUARDRAIL ANCHOR UNITS, TYPE B-77",4,"Each",862,"Guardrail (GR)"]
["3319000000-N - GUARDRAIL ANCHOR UNITS, TYPE B-83","3319000000-N","GUARDRAIL ANCHOR UNITS, TYPE B-83",4,"Each",862,"Guardrail (GR)"]
["3389200000-E - CABLE GUIDERAIL","3389200000-E","CABLE GUIDERAIL",4,"Linear Feet",865,"Guardrail (GR)"]
["3389400000-E - DOUBLE FACED CABLE GUIDERAIL","3389400000-E","DOUBLE FACED CABLE GUIDERAIL",4,"Linear Feet",865,"Guardrail (GR)"]
["3389500000-N - ADDITIONAL GUIDERAIL POSTS","3389500000-N","ADDITIONAL GUIDERAIL POSTS",4,"Each",865,"Guardrail (GR)"]
["3500000000-E - WOVEN WIRE FENCE, **\" FABRIC","3500000000-E","WOVEN WIRE FENCE, **\" FABRIC",5,"Linear Feet",866,"Fence(F)"]
["3503000000-E - WOVEN WIRE FENCE, 47\" FABRIC","3503000000-E","WOVEN WIRE FENCE, 47\" FABRIC",5,"Linear Feet",866,"Fence(F)"]
["3518000000-E - CHAIN LINK FENCE, **\" FABRIC WITH REDWOOD PICKETS","3518000000-E","CHAIN LINK FENCE, **\" FABRIC WITH REDWOOD PICKETS",5,"Linear Feet",9000,"Fence(F)"]
["3521000000-E - VINYL COATED CHAIN LINK FENCE, **\" FABRIC WITH REDWOOD PICKETS","3521000000-E","VINYL COATED CHAIN LINK FENCE, **\" FABRIC WITH REDWOOD PICKETS",5,"Linear Feet",9000,"Fence(F)"]
["3524000000-E - VINYL COATED CHAIN LINK FENCE, **\" FABRIC","3524000000-E","VINYL COATED CHAIN LINK FENCE, **\" FABRIC",5,"Linear Feet",9000,"Fence(F)"]
["3527000000-E - CHAIN LINK FENCE, **\" FABRIC, GUARDRAIL MOUNTED","3527000000-E","CHAIN LINK FENCE, **\" FABRIC, GUARDRAIL MOUNTED",5,"Linear Feet",9000,"Fence(F)"]
["3530000000-E - CHAIN LINK FENCE, **\" FABRIC WITH 1\" MESH","3530000000-E","CHAIN LINK FENCE, **\" FABRIC WITH 1\" MESH",5,"Linear Feet",9000,"Fence(F)"]
{"$rows_left_out":176}
{"sheet":"Sheet1","index":3,"n_rows":6,"n_cols":1,"rows_kept":6,"cut":false,"hidden":true,"merged":[]}
["Formulas for SPA-1"]
[]
["Yes"]
["No"]
[]
["Enter Spec Year"]